E-COM-NET
首页
在线工具
Layui镜像站
SUI文档
联系我们
推荐频道
Java
PHP
C++
C
C#
Python
Ruby
go语言
Scala
Servlet
Vue
MySQL
NoSQL
Redis
CSS
Oracle
SQL Server
DB2
HBase
Http
HTML5
Spring
Ajax
Jquery
JavaScript
Json
XML
NodeJs
mybatis
Hibernate
算法
设计模式
shell
数据结构
大数据
JS
消息中间件
正则表达式
Tomcat
SQL
Nginx
Shiro
Maven
Linux
淘淘商城报错解决
MySQL - Zero date value prohibited
com.mysql.cj.exceptions.DataReadException:Zerodatevalueprohibited原因:timestamp字段存入了0值,超出了最小值1900-01-0100:00:00,转Java对象的时候
报错解决
你赖东东不错嘛~
·
2023-11-04 10:31
mysql
数据库
如何用Python导出onnx模型
sklearn导出onnx详解及
报错解决
方案写在前面onnx格式在机器学习模型多方软件调用中非常好用,scikit-learn库导出onnx却还存在不少问题,当然github上也有不少大牛在逐渐完善,其中针对
灵魂钥匙
·
2023-11-04 02:12
Python专栏
sklearn
python
scikit-learn
code EINTEGRITY
报错解决
方法,亲测有效!
以上是运行npminstall安装依赖报的错解决方法:1、删除项目package-lock.json文件2、执行清理缓存指令npmcacheclean--force执行行会有一个警告,忽略即可。3、最后再去执行npminstall进行安装,发现就可以正常安装了,这时候,会发现有新生成的package.lock.json文件。
鲸洛洛
·
2023-11-03 22:16
vue2
vue3
npm
前端
node.js
RabbitMQ启动管理插件
报错解决
方案
问题:安装RabbitMQ之后启动管理插件:rabbitmq-pluginsenablerabbitmq_management报错时信息如下:解决:我安装的RabbitMQ的版本是3.7.5,Erlang的版本是21,是版本不匹配造成,修改Erlang的版本为20,问题解决。
没图怎么玩儿
·
2023-11-03 18:56
Tests run: 1, Failures: 0, Errors: 1, Skipped: 0, Time elapsed: 8.074 s <<< FAILURE - in com.xxx.X
报错原因:项目Install打包
报错解决
方法:可以将test不打包,方法选中test点击上面类似闪电的按钮即可。操作步骤:这样子就直接
ヾ凉秋
·
2023-11-03 15:48
spring
boot
spring
boot
iOS项目从Xcode8升级Xcode13各种
报错解决
记录
前言公司有一个很老款的iOS应用,原来在xcode8开发的,现在到iOS15系统跑不起来了,被迫升级之。。遇到一些问题,总结如下文。问题1编译报错Multiplecommandsproduce……截图1Multiplecommandsproduce'/Users/user/Library/Developer/Xcode/DerivedData/LoanVisit-ghqbwiuunlciygdkz
kkone
·
2023-11-03 12:36
d2l.train_ch3函数,将输入数据转化为该函数所接受的格式
d2l.train_ch3(net,train_iter,test_iter,loss,num_epochs,batch_size,None,None,trainer)这个函数进行softmax回归计算问题:使用非官方的数据
报错解决
方法
橙序员一号
·
2023-11-03 09:08
深度学习
Expected indentation of 16 spaces but found 8 spaces.eslintvue/script-indent
问题:Expectedindentationof16spacesbutfound8spaces.eslintvue/script-indent原因:严格地检查缩进问题,并不是
报错解决
:方法一:我们可以关闭这个检查规则
ToOTOooo
·
2023-11-03 08:19
vue
前端
react 启动报错:Uncaught TypeError: Cannot read properties of undefined (reading ‘forEach‘)
安装完react开发者工具后,再启动
报错解决
办法:根据上面目录找到相应js文件,注释掉报错代码即可。
不能懒鸭
·
2023-11-03 07:34
报错经验
前端
npm
react.js
NLP之Bert实现文本分类
文章目录1.代码展示2.整体流程介绍3.代码解读4.
报错解决
4.1解决思路4.2解决方法5.Bert介绍5.1什么是BertBERT简介:BERT的核心思想:BERT的预训练策略:BERT的应用:为什么
赵孝正
·
2023-11-02 21:07
#
1.
自然语言处理&知识图谱
自然语言处理
bert
分类
Eclipse @override
报错解决
我想这个问题肯定困扰了很多人,我也不例外。新公司用的东西多多少少会与我们以前公司的有所不同。所以这个问题也时常伴随在我们身边。第一种解决方案:@Override是JDK5就已经有了,但有个小小的Bug,就是不支持对接口的实现,认为这不是Override而JDK6修正了这个Bug,无论是对父类的方法覆盖还是对接口的实现都可以加上@Override修改你的eclipse指定的编译器版本在选项里的jav
攻城狮Luke(刘健彬)
·
2023-11-02 12:15
Java
maven/git
Eclipse
maven
vue cli2/cli3构建项目的相关使用和vue全家桶的使用
此文章为自主学习哔哩哔哩ilovecoding的视频过程中留下的笔记认为很重要,如有侵权需要删除请联系vue相关内容(较为详细请仔细阅读)1.VueCli基本使用1.安装npminstall-g@vue/cli安装
报错解决
方式
xhlcoder
·
2023-11-02 07:30
前端
vue
vue.js
javascript
node.js
vue-cli3
前端
激活Windows过程及
报错解决
: 0x803f7001 在运行Microsoft Windows 非核心版本的计算机上, 运行“ slui.exe 0x2a 0x803f7001 “以显示错误文本
激活Windows过程及报错问题解决:0x803f7001在运行MicrosoftWindows非核心版本的计算机上,运行“slui.exe0x2a0x803f7001“以显示错误文本。一.解决0x803F7001在运行MicrosoftWindows非核心版本的计算机错误 首先,按下win+R打开"运行",输入regedit后回车,打开注册表。然后再注册表下输入地址HKEY_LOCAL_MACH
ninghes
·
2023-11-02 04:14
Windows
windows
microsoft
前端启动
报错解决
, Cannot find module ‘@vue/babel-plugn-transform-vue-jsx‘
第一步:cnpminstall或者yarninstall,当前所有命令必须当前工程目录下进行,目录结构如下:第二步:在控制台输入命令:npmrundev,控制台打印出如下画面,恭喜表示本项目启动成功拉。第三步:启动报错第四步:解决方案:npminstall@vue/babel-plugin-transform-vue-jsx--save-dev
嘟嘟鹏
·
2023-11-02 01:18
java
前端
vue.js
npm
Fedora 32安装Kaldi
网上很多LInux安装Kaldi的链接,讲的都比较明确,例如:kaldi的编译安装与
报错解决
方法_extras/check_dependencies.shextras/check_dependen-CSDN
胖多鱼
·
2023-11-02 01:50
Kaldi
ThinkPHP6 安装 think-queue
报错解决
composer安装composerrequiretopthink/think-queue复制vendor/topthink/think-queue/src/config.php=>config/queue.php配置文件queue.php后执行phpthinkservice:discover后OK
aifly_xst
·
2023-11-01 23:54
ThinkPHP
npm run dev各种报错
npminstall
报错解决
办法原因是因为node_modules可能有意外改动,导致依赖库不完整,删除项目下的node_modules,在你的项目目录下,重新执行npminstall,这会重新生成node_modules
游弋在冷风中
·
2023-11-01 21:57
vue.js
Superset_
报错解决
Superset_
报错解决
Nomodulenamedsqlite2由于元数据管理统一使用mysql,后面就没有认真分析失败原因了。
剑御
·
2023-11-01 18:36
【SpringBoot】SpringBoot项目开发
报错解决
记录
1.JDK环境配置JavaHome:jdk存放位置,作为一个环境变量。ClassPath:存放类的路径,也就是说项目开发中使用到的一些类会从该目录下中找,比如java.langjavax等包。2.mavenmaven有一个本地仓库:localRespitory本地仓库就是我们使用依赖下载存放的位置。镜像问题:需要配置阿里云镜像,但是阿里云镜像会过期或者更新地址,注意实时更新。找不到包问题:有时候下
爱喝咖啡的Tomcat
·
2023-11-01 17:26
spring
spring
boot
java
spring
ImportError: libGL.so.1: cannot open shared object file: No such file or directory
问题:importcv2时
报错解决
方案:pipinstallopencv-pythonpipinstallopencv-contrib-pythonapt-getinstall-ylibgl1-mesa-dev
Francis__Li
·
2023-11-01 14:58
opencv
python
人工智能
ValueError: unrecognized engine zarr must be one of: [‘scipy‘, ‘store‘] 使用zarr以及xarray报错
x=xr.open_zarr(data_name,consolidated=True)在运行上述代码打开数据时遇到了报错……查看了很多文章发现按照以下步骤将
报错解决
了!!!!
hi51
·
2023-11-01 09:45
前端
开发语言
python
记录MVVM+Kotlin学习遇到的问题
自定义binding运行
报错解决
:1.在appGradle文件添加applyplugin:'kotlin-kapt'2.在自定义方法添加@JvmStatic注释
LittleMaNong
·
2023-11-01 08:28
linux或者mac下启动Nacos
报错解决
:nohup: /Users/xx/jdk/java/bin/java: No such file or directory
启动Nacos
报错解决
nacosisstarting;youcancheckthe/Volumes/MXY/work/devtool/nacos/logs/start.out经过我去看这个目录下的文件nohup
月明千古间
·
2023-11-01 07:14
java
linux
macos
2020-03-19学习Python笔记
AttributeError:'list'objecthasnoattribute'send_keys'解决:把find_elements_by_id方法改成find_element_by_id2、没有定位到下拉框,没
报错解决
桃花鱼书斋
·
2023-10-31 21:24
windows 命令行ssh远程linux
报错解决
报错信息如下报错原因:是因为之前的域名解析改了ip地址所以,当远程时使用的是原域名的key所以
报错解决
方法:在报错信息中找到key存储的位置用记事本打开找到你对应ip地址修改一下key就行,或者直接删除
叶功隽
·
2023-10-31 18:55
报错解决
linux
ssh
运维
pre-commit hook failed
报错解决
错误呈现在git提交代码到远程库时,有时候会报pre-commithookfailed错误,导致提交失败。错误截图如下:解决在项目所在目录下的.git文件夹下(如果找不到,可能是隐藏了,可以通过设置文件夹属性找出来)的hooks文件下有一个pre-commit文件,删掉此文件,再次提交即可成功。
tomorrownan
·
2023-10-31 18:04
git
git
pre-commit
ts-node运行
报错解决
办法
当运行版本比较新的ts-node会出现报错两个解决办法-办法一
[email protected]
装这个比较旧的版本-办法二运行tsc--init-办法二会带来一个变量报错新的问题,解决办法也很简单//ts的配置文件,默认是全局的模块化环境,所以定义的变量会冲突,,{constnum=11}
Arno_2022
·
2023-10-31 12:58
npm
前端
node.js
ts
javascript
React Native安装react-native-router-flux报权限错误
1、没有sudosu报错2、用sudosu
报错解决
方法:sudonpmireact-native-router-flux--save
Loki_
·
2023-10-31 11:51
ios-webkit-debug-proxy启动
报错解决
macOS:10.14.5xcode:10.0appium:1.13.0命令安装(借助淘宝镜像)1、启动真机safari,报错“Couldnotnavigatetowebview”,经分析ios-webkit-debug-proxy没有启动;2、安装‘brewinstallios-webkit-debug-proxy’,启动‘ios_webkit_debug_proxy-cUUID:27753-d
wuyepiaoxue789
·
2023-10-31 11:34
IOS自动化
MySql高级:explain及索引优化
rpm安装查看是否安装了myslrpm-qa|grep-imysql一定要下载指定的64位,因为电脑是64位的否则会安装失败https://www.jb51.net/article/129294.htm
报错解决
办法安装
yubin1285570923
·
2023-10-31 10:56
#
数据库
MySql
mysql
mysql优化
python3.7.2使用web.py
报错解决
办法
python3.7.2使用web.py
报错解决
办法首先请确保使用pipinstallweb.py==0.40-dev11安装web.py。
SaylerZheng
·
2023-10-31 00:01
linux 模块安装与卸载
文章目录模块实现编译模块的makefile编译
报错解决
模块编译日志自动化模块安装模块卸载配置头文件路径C/C++插件clangd插件模块实现新建my_module.c文件#include#include
tyustli
·
2023-10-30 23:12
#
kernel
linux
module
安装
卸载
Ubuntu 22更新kernel导致nvidia-smi
报错解决
方案
命令行安装报错软件包nvidia-dkms-535尚未配置重新运行sudosh'/media/cao/CAO/Doctor/cuda_11.7.0_515.43.04_linux.run'报错cc:error:unrecognizedcommandlineoption'-mharden-sls=all'升级gcc版本原来是9现在改成11或者12应该都行,我改城11可以安装了sudoupdate-a
hitercch
·
2023-10-30 14:12
ubuntu
linux
运维
点击Python Console报错TypeError: an integer is required (got type bytes)
点击PythonConsole后直接
报错解决
办法:仔细查阅会发现有一个_compat.py文件报错。
是强筱华哇!
·
2023-10-30 10:47
问题解决
python
开发语言
运行yolov3
报错解决
运行yolov3
报错解决
#代码的克隆地址https://github.com/ultralytics/yolov3.git运行自己的数据集时报了如下的错误Traceback(mostrecentcalllast
稻谷君W
·
2023-10-30 09:06
深度学习
python
目标检测
YOLO
NET连接mysql字符串
【尝试读取MySQL中流错误的过去结束】NET连接mysql截图连接运行后
报错解决
方案:**问题描述:之前visualstudio2015连接mysql正常,之前的mysql版本为5.0,后来数据库迁移后
weixin_42170496
·
2023-10-30 08:57
asp.net
J2EE项目部署与发布(Windows版本)
目录一、会议OA单体项目Windows部署1.1数据测试1.2项目部署1.3
报错解决
1.4最终效果二、spa前后端分离项目Windows部署2.1后端代码测试2.2前端代码测试2.3项目部署2.3.1数据导入
Kissship
·
2023-10-30 08:41
java-ee
java
windows
前端
开发语言
java.lang.IllegalArgumentException: Param ‘serviceName‘ is illegal, serviceName is blank
报错解决
目录前言系列文章目录一、项目启动报错1、报错截图2、错误信息二、解决方案1.错误原因2.排查建议前言本篇博客使用SpringCloud2021版本、Nacos1.4.0、SpringBoot2.7.6系列文章目录SpringBoot2.0系列教程合集、SpringCloud系列教程合集、SpringBoot常见错误合集、SpringCloud常见错误合集_zjh_746140129的博客-CSDN
zjh_746140129
·
2023-10-30 03:25
Spring
Cloud系列教程
Spring
Boot2.0系列教程
Spring
Boot
java
spring
cloud
eureka
cocoapods 更新SDWebImageWebPCoder
报错解决
1.前往文件夹~/.cocoapods/repo,如下repos2.master->Specs->1->9->2->libwebp->1.1.0(最新版本,非rc),source下的git改为https://github.com/webmproject/libwebp.git,如下"source":{"git":"https://github.com/webmproject/libwebp.git
小卒的梦
·
2023-10-29 20:35
SpringBoot注入RestTemplate
在直接注入RestTemplate时,会出现如下错误:注入RestTemplate
报错解决
RestTemplate注入问题,只需要修改Application类即可publicclassSpringBootApplication
跟我回家_f429
·
2023-10-29 14:54
Jupyter Notebook的使用
二、使用步骤1.安装Miniconda2.安装启动**JupyterNotebook**3.一些问题三、JupyterNotebook的操作1.更换解释器2.在指定的文件夹中打开四.
报错解决
1.画图的时候出现报错
小小快刀手
·
2023-10-29 13:31
jupyter
ide
python
vue项目报错集合
最终
报错解决
,运行成功,把sourcetree中所有改动丢弃,依旧完美启动。1、sh:webpack-dev-server:commandnotfound解决:cnpminstall
笑胖仔
·
2023-10-29 07:33
M1 安装pandas
报错解决
方法
问题:pipinstallpandas报错commanderroredoutwithexitstatus1解决方法:brewinstallopenblaspip3installcythonOPENBLAS="$(brew--prefixopenblas)"pip3installnumpy--no-use-pep517OPENBLAS="$(brew--prefixopenblas)"pip3ins
Archie_uk
·
2023-10-28 18:17
Django
python
pandas
VS Code Python turtle库
报错解决
如果出现turtle库引用后的红色波浪线报错,如下:仅需在VSCode中的settings.json添加如下代码即可:"python.linting.pylintArgs":["--generate-members"]
边牧哥哥sos
·
2023-10-28 12:55
spring boot 空字符串序列化为枚举类,
报错解决
配置单独的ObjectMapper,加上属性就可以了,代码如下@Bean@PrimarypublicObjectMapperobjectMapper(){ObjectMapperobjectMapper=newObjectMapper();objectMapper.configure(DeserializationFeature.FAIL_ON_UNKNOWN_PROPERTIES,false);
aitxiaogang
·
2023-10-28 09:33
SpringBoot
spring
有关“Run-Time Check Failure #2 - Stack around the variable ‘arr‘ was corrupted.“问题解决办法
个人主页:修修修也所属专栏:程序调试及
报错解决
⚙️操作环境:VisualStudio2022目录问题描述原因分析解决方法结语问题描述我们在使用C语言编写程序,特别是使用数组进行相关操作时经常会遇到编译器报错
修修修也
·
2023-10-28 07:07
程序调试及报错解决
学习
bug
笔记
c语言
开发语言
c++
CentOS 7 下安装 Impala 5.14
报错解决
方法
Error:Package:impala-shell-2.11.0+cdh5.14.0+0-1.cdh5.14.0.p0.50.el6.x86_64(cdh)Requires:libpython2.6.so.1.0()(64bit)Error:Package:impala-2.11.0+cdh5.14.0+0-1.cdh5.14.0.p0.50.el6.x86_64(cdh)Requires:li
YasinZhu
·
2023-10-28 06:45
2022-09-30_juicer
报错解决
Exception in thread "main" java.lang.RuntimeException: Unknown command: stat...
报错Exceptioninthread"main"java.lang.RuntimeException:Unknowncommand:statistics解决方式看到一个博客的解决https://groups.google.com/g/3d-genomics/c/ngRL5BK9C7M直接换掉juicer_tools.jar就可以了下载链接:https://github.com/aidenlab/
jiarf
·
2023-10-28 00:02
SpringCloud中feign调用:status 401 reading xxxxxx#
报错解决
报错如下:2020-03-0309:50:06.669ERROR[manage-backend,7f1a4a51cb733f80,ff352df21d5945bd,false]3068—[o-auto-1-exec-3]c.c.b.controller.OrderBillController:status401readingUserClient#findMerchantInfoById(Strin
睁开眼睛去看这个世界
·
2023-10-27 23:49
java-项目环境问题
uniapp打包字节抖音小程序使用$refs
报错解决
办法
最近在做uniapp打包小程序的时候,发现uniapp打包抖音小程序后,组件使用的ref定义后,在this.$refs中都获取不到组件的实例(这里用开发者工具是没问题的,需要在真机调试),于是乎就开始了各种搜索,找解决方案。1、首先是查的抖音小程序的官网生命周期顺序上图是抖音官网的组件加载顺序生命周期图。按照上图,我把所有卸载onLoad方法中的相应数据都放到了onReady中,然后真机测试依然是
75624839
·
2023-10-27 21:57
uni-app
小程序
上一页
11
12
13
14
15
16
17
18
下一页
按字母分类:
A
B
C
D
E
F
G
H
I
J
K
L
M
N
O
P
Q
R
S
T
U
V
W
X
Y
Z
其他